Home > Msi Error > There Was An Error Applying Transforms. Verify That The Specified Transform Paths Are Valid.

There Was An Error Applying Transforms. Verify That The Specified Transform Paths Are Valid.

Contents

Contact your support personnel. RSS Articles Advanced Search Search the Knowledgebase Top Columbus Packaging Office installation fails with MSI error 1624 Reference Number:AA-00628 Views: 3593 Created: 25/05/2012 11:00 Last Updated: 12/06/2012 13:38 0 Rating/ Voters Verify that the specified log file location exists and is writable. ERROR_UNKNOWN_PROPERTY1608This is an unknown property. Source

Nothing to be done 13 ERROR_INVALID_DATA The data is invalid 87 ERROR_INVALID_PARAMETER One of the parameters was invalid. 1601 ERROR_INSTALL_SERVICE_FAILURE The Windows Installer service could not be accessed. Bookmark the permalink. FIX: Columbus 7.3.2 - Fix 102 HOW TO: Extract the MSI for 32-Bit Java PHP Knowledge Base by: KnowledgeBase Manager Pro v6.2.2 (Built with: JS.GUI - AJAX Controls) Google Grupları Tartışma Tagged 1624, ERROR_INSTALL_TRANSFORM_FAILURE, exit code 1624, fix error 1624, msi error 1624, msiexec, return value 1624, windows installer. https://social.technet.microsoft.com/Forums/office/en-US/35889a69-a4fd-430d-8488-897d298da449/windows-installer-error-1624-error-applying-transforms?forum=w7itprogeneral

There Was An Error Applying Transforms. Verify That The Specified Transform Paths Are Valid.

Complete that installation before proceeding with this install.For information about the mutex, see _MSIExecute Mutex. Error codes for Windows Installer May 6, 2013 by admin 0 We're presenting below a list of exit codes that msiexec.exe returns and, in some cases, what to do to fix Can you search for the text 'return value 3' and post the 10 or so lines before it.Regards,Ken 1334-87413-580242 Back to top Laticia Bomar Members #3 Laticia Bomar 3 posts Posted Average Rating 3 37119 views 01/23/2004 Software Deployment Windows Installer (MSI) Windows Installer (MSI) Error Messages Help with MSI (Microsoft Installer) error 1624: There was an error applying transforms.

ERROR_INSTALL_USEREXIT1602The user cancels installation. Like Show 0 Likes(0) Actions Go to original post Actions More Like This Retrieving data ... Looking for it at the original location.Unable to create a temp copy of transform 'F:\Setup\Transforms\MPS.mst'.DEBUG: Error 2203: Database: F:\Setup\Transforms\MPS.mst. Windows Installer Issue can be that the transform is marked Windows Installer 3.n only, and it's attempting execution on a PC with Windows Installer 2 only on it.

Contact the application vendor to verify that this is a valid Windows Installer patch package. Available beginning with Windows Installer version 4.5. Re: Update Error: 1624 pjgfi Nov 24, 2010 6:08 AM (in response to Kwahaes) I had the same problem for days, here's what did the trick for me : there's a click here now All rights reserved.Newsletter|Contact Us|Privacy Statement|Terms of Use|Trademarks|Site Feedback Developer resources Microsoft developer Windows Windows Dev Center Windows apps Desktop Internet of Things Games Holographic Microsoft Edge Hardware Azure Azure Web apps

Verify that the specified transform paths are valid. Windows Installer Cleanup Utility Contact your support personnel to verify that the Windows Installer service is properly registered. Please enter a title. Contact the application vendor to verify that this is a valid Windows Installer package.

Msi Error 1619

Any ideas on how to fix this problem or what is going on? http://www.msierrors.com/msi/msi-error-1624/ Multiple-Package Installations cannot run if rollback is disabled. There Was An Error Applying Transforms. Verify That The Specified Transform Paths Are Valid. This documentation is archived and is not being maintained. Error 1624 Error Applying Transforms Answers 1 If the transform is is called from the network, check that access to the drive is always accessible.

C:\CAE1.5 (don't download into your profile / onto your desktop, or a network share).#4 - Re-run the installation.Regards,Ken 1334-87413-580337 Back to top Laticia Bomar Members #5 Laticia Bomar 3 posts Posted this contact form OS updates are current. ERROR_UNKNOWN_FEATURE1606The feature identifier is not registered. I get a message saying there is an update to install. Installation Success Or Error Status 1603

Verify that the package exists and is accessible, or contact the application vendor to verify that this is a valid Windows Installer package. All Rights Reserved. | Powered by Help | Terms of Use | Privacy Policy and Cookies (UPDATED) | Forum Help | Tips for AskingJive Software Version: 8.0.3.0 , revision: 20160218075410.6eafe9c.release_8.0.3.x PC Windows Logo Testing warning on XP Deploying Acrobat 6.01 with GPO using MSIEXEC switches Repackaging Software that requires a Unique Serial Number Application & Content Deployment Tool MYOB14 (Ver 2004) Error have a peek here Contact the application vendor to verify that this is a valid Windows Installer patch package. 1637 ERROR_PATCH_PACKAGE_UNSUPPORTED This patch package cannot be processed by the Windows Installer service.

Privacy statement  © 2016 Microsoft. It might happen after a KB that affects it has just been installed. You must install a Windows service pack that contains a newer version of the Windows Installer service.

Solution: Restarting the machine usually solves the problem. 1602 ERROR_INSTALL_USEREXIT User cancel installation.

ERROR_PRODUCT_UNINSTALLED1614The product is uninstalled. ERROR_PATCH_TARGET_NOT_FOUND1642The installer cannot install the upgrade patch because the program being upgraded may be missing or the upgrade patch updates a different version of the program. ERROR_BAD_CONFIGURATION1610The configuration data for this product is corrupt. Contact your support personnel. 1622 ERROR_INSTALL_LOG_FAILURE Error opening installation log file.

To configure or remove the existing version of this product, use Add/Remove Programs in Control Panel. 1639 ERROR_INVALID_COMMAND_LINE Invalid command line argument. This does not include installs where the ForceReboot action is run.       Show: Inherited Protected Print Export (0) Print Export (0) Share IN THIS ARTICLE Is this page helpful? acrobat is part of the the CS4 master collection on my computer. http://nodatasource.com/msi-error/msi-error-1-2711.html I'm going to assume you've downloaded CAE, rather than installing from a physical CD.I'd advise taking these steps:#1 - Go to your temporary files folder, and clean it (type %TEMP% into

ERROR_INSTALL_PACKAGE_INVALID1620This installation package could not be opened. TechNet Products IT Resources Downloads Training Support Products Windows Windows Server System Center Browser   Office Office 365 Exchange Server   SQL Server SharePoint Products Skype for Business See all products